{"text_format":"3","workbook":"xlsx","n_sheets":2,"sheets":["Liquidación","Tasas de Interes"],"not_rendered":{"defined_names":2},"read":"whole","date_system":"1900"}

{"sheet":"Liquidación","index":0,"n_rows":103,"n_cols":19,"rows_kept":103,"merged":[[2,11,2,12],[2,13,2,16],[4,2,4,6],[4,7,4,8],[4,12,5,12],[4,13,5,13],[4,14,5,15],[5,2,6,6],[5,7,6,8],[6,9,8,10],[6,14,6,15],[7,14,7,15],[8,14,8,15],[9,2,16,2],[9,3,10,3],[9,4,10,5],[9,9,9,10],[9,14,9,15],[10,14,10,15],[11,9,13,10],[11,14,11,15],[12,3,13,3],[12,4,13,5],[12,14,12,15],[13,14,13,15],[14,9,14,10],[14,14,14,15],[15,3,16,3],[15,4,16,5],[15,14,15,15],[16,9,18,10],[16,14,16,15],[17,4,20,5],[17,14,17,15],[18,14,18,15],[19,9,20,10],[19,14,19,15],[20,14,20,15],[21,14,21,15],[25,1,38,1],[25,7,38,7],[25,13,38,13],[41,1,54,1],[41,7,54,7],[41,13,54,13],[57,1,70,1],[57,7,70,7],[57,13,70,13],[73,1,86,1],[73,7,86,7],[73,13,86,13],[89,1,102,1],[89,7,102,7],[89,13,102,13]]}
[]
[]
[null,null,"LIQUIDACIÓN INTERESES MORATORIOS",{"$nulls":8},"Fecha Liquidación:",null,{"$f":"TODAY()","v":"2026-02-02"}]
[{"$nulls":13},"2023-07-01"]
[null,null,"Contribuyente (Razón Social)",{"$nulls":4},"NIT",{"$nulls":4},"Año","Días en Mora","Valor Intereses *"]
[]
[{"$nulls":9},{"$f":"N22","v":4},null,null,{"$f":"IF(N7=0,0,IFERROR(B26,0))","v":2025},{"$f":"IFERROR(F39,0)","v":4},{"$f":"IF($E$16<$N$4,IFERROR(Liquidación!G39,0),0)","v":{"v":0,"d":"$0.00"}}]
[{"$nulls":12},{"$f":"IF(N8=0,0,IFERROR(H26,0))","v":0},{"$f":"IFERROR(L39,0)","v":0},{"$f":"IF($E$16<$N$4,IFERROR(Liquidación!M39,0),0)","v":{"v":0,"d":"$0.00"}}]
[{"$nulls":12},{"$f":"IF(N9=0,0,IFERROR(N26,0))","v":0},{"$f":"IFERROR(R39,0)","v":0},{"$f":"IF($E$16<$N$4,IFERROR(Liquidación!S39,0),0)","v":{"v":0,"d":"$0.00"}}]
[null,null,"DATOS DE ENTRADA","Valor Impuesto",{"v":9700927,"d":"$9,700,927"},{"$nulls":4},"DIAS EN MORA",null,null,{"$f":"IF(N10=0,0,IFERROR(B42,0))","v":0},{"$f":"IFERROR(F55,0)","v":0},{"$f":"IF($E$16<$N$4,IFERROR(Liquidación!G55,0),0)","v":{"v":0,"d":"$0.00"}}]
[{"$nulls":12},{"$f":"IF(N11=0,0,IFERROR(H42,0))","v":0},{"$f":"IFERROR(L55,0)","v":0},{"$f":"IF($E$16<$N$4,IFERROR(Liquidación!M55,0),0)","v":{"v":0,"d":"$0.00"}}]
[{"$nulls":9},{"$f":"IF(E16<N4,ROUND(O22*1000,-1),H22)","v":{"v":24470,"d":"$24,470"}},null,null,{"$f":"IF(N12=0,0,IFERROR(N42,0))","v":0},{"$f":"IFERROR(R55,0)","v":0},{"$f":"IF($E$16<$N$4,IFERROR(Liquidación!S55,0),0)","v":{"v":0,"d":"$0.00"}}]
[{"$nulls":3},"Fecha Vencimiento","2025-12-15",{"$nulls":7},{"$f":"IF(N13=0,0,IFERROR(B58,0))","v":0},{"$f":"IFERROR(Liquidación!F71,0)","v":0},{"$f":"IF($E$16<$N$4,IFERROR(Liquidación!G71,0),0)","v":{"v":0,"d":"$0.00"}}]
[{"$nulls":12},{"$f":"IF(N14=0,0,IFERROR(H58,0))","v":0},{"$f":"IFERROR(Liquidación!L71,0)","v":0},{"$f":"IF($E$16<$N$4,IFERROR(Liquidación!M71,0),0)","v":{"v":0,"d":"$0.00"}}]
[{"$nulls":9},"VALOR INTERESES",null,null,{"$f":"IF(N15=0,0,IFERROR(N58,0))","v":0},{"$f":"IFERROR(Liquidación!R71,0)","v":0},{"$f":"IF($E$16<$N$4,IFERROR(Liquidación!S71,0),0)","v":{"v":0,"d":"$0.00"}}]
[{"$nulls":3},"Fecha de Pago","2025-12-19",{"$nulls":7},{"$f":"IF(N16=0,0,IFERROR(B74,0))","v":0},{"$f":"IFERROR(Liquidación!F87,0)","v":0},{"$f":"IF($E$16<$N$4,IFERROR(Liquidación!G87,0),0)","v":{"v":0,"d":"$0.00"}}]
[{"$nulls":9},{"$f":"E10+J12","v":{"v":9725397,"d":"$9,725,397"}},null,null,{"$f":"IF(N17=0,0,IFERROR(H74,0))","v":0},{"$f":"IFERROR(Liquidación!L87,0)","v":0},{"$f":"IF($E$16<$N$4,IFERROR(Liquidación!M87,0),0)","v":{"v":0,"d":"$0.00"}}]
[{"$nulls":12},{"$f":"IF(N18=0,0,IFERROR(N74,0))","v":0},{"$f":"IFERROR(R87,0)","v":0},{"$f":"IF($E$16<$N$4,IFERROR(Liquidación!S87,0),0)","v":{"v":0,"d":"$0.00"}}]
[{"$nulls":12},{"$f":"IF(N19=0,0,IFERROR(B90,0))","v":0},{"$f":"IFERROR(F103,0)","v":0},{"$f":"IF($E$16<$N$4,IFERROR(Liquidación!G103,0),0)","v":{"v":0,"d":"$0.00"}}]
[{"$nulls":9},"TOTAL A PAGAR\nValor Impuesto + Intereses",null,null,{"$f":"IF(N20=0,0,IFERROR(H90,0))","v":0},{"$f":"IFERROR(L103,0)","v":0},{"$f":"IF($E$16<$N$4,IFERROR(Liquidación!M103,0),0)","v":{"v":0,"d":"$0.00"}}]
[{"$nulls":12},{"$f":"IF(N21=0,0,IFERROR(N90,0))","v":0},{"$f":"IFERROR(R103,0)","v":0},{"$f":"IF($E$16<$N$4,IFERROR(Liquidación!S103,0),0)","v":{"v":0,"d":"$0.00"}}]
[null,{"$f":"YEAR(E16)","v":2025},{"$f":"MONTH(E16)","v":12},{"$f":"VLOOKUP(C22,'Tasas de Interes'!A2:B14,2,0)","v":"Dic"},{"$f":"INDEX('Tasas de Interes'!$D$3:$BB$14,MATCH($D22,'Tasas de Interes'!$B$3:$B$14,0),MATCH($B$22,'Tasas de Interes'!$D$2:$BB$2,0))","v":{"v":0.2302,"d":"23.020%"}},{"$f":"EOMONTH(DATE($B$22,VLOOKUP(D22,'Tasas de Interes'!$B$3:$C$14,2,0),0),0)","v":"2025-11-30"},{"$f":"N22","v":4},{"$f":"ROUND(($E$10*(E22/365)*G22),-1)","v":{"v":24470,"d":"24,470"}},{"$nulls":4},"Total",{"$f":"SUM(N7:N21)","v":4},{"$f":"SUM(O7:O21)","v":{"v":0,"d":"$0.00"}},null,"* Cifra en Miles de Pesos"]
[]
[null,null,"* Todos los Años: Valor Intereses en Miles de pesos"]
[null,{"$f":"IF(ISERROR(B26),\"E\",B26)","v":2025},{"$nulls":3},0,null,{"$f":"IF(ISERROR(H26),\"E\",H26)","v":"E"},{"$nulls":3},{"$f":"F25+F39","v":4},null,{"$f":"IF(ISERROR(N26),\"E\",N26)","v":"E"},{"$nulls":3},{"$f":"L25+L39","v":{"$error":"#N/A"}}]
[null,{"$f":"YEAR(E13)","v":2025},"Mes","Tasa","Fecha Fin Mes","Dias Mora","Valor Intereses *",{"$f":"IF(YEAR($E$16)<>$B$26,$B$26+1,NA())","v":{"$error":"#N/A"}},"Mes","Tasa","Fecha Fin Mes","Dias Mora","Valor Intereses *",{"$f":"IF(YEAR($E$16)<>$H$26,$H$26+1,NA())","v":{"$error":"#N/A"}},"Mes","Tasa","Fecha Fin Mes","Dias Mora","Valor Intereses *"]
[null,null,"Ene",{"$f":"INDEX('Tasas de Interes'!$D$3:$BB$14,MATCH($C27,'Tasas de Interes'!$B$3:$B$14,0),MATCH($B$26,'Tasas de Interes'!$D$2:$BB$2,0))","v":{"v":0.2289,"d":"22.89%"}},{"$f":"EOMONTH(DATE($B$26,VLOOKUP(C28,'Tasas de Interes'!$B$3:$C$14,2,0),0),0)","v":"2025-01-31"},{"$f":"IF(E27<$E$13,0,IF(E27>$E$16,$E$16-$E$13-SUM($F$25:F26),E27-$E$13-SUM($F$25:F26)))","v":0},{"$f":"IF($E$16<$N$4,($E$10*(D27/366)*F27)/1000,0)","v":{"v":0,"d":"$0.00"}},null,"Ene",{"$f":"INDEX('Tasas de Interes'!$D$3:$BB$14,MATCH($I27,'Tasas de Interes'!$B$3:$B$14,0),MATCH($H$26,'Tasas de Interes'!$D$2:$BB$2,0))","v":{"$error":"#N/A"}},{"$f":"EOMONTH(DATE($H$26,VLOOKUP(I28,'Tasas de Interes'!$B$3:$C$14,2,0),0),0)","v":{"$error":"#N/A"}},{"$f":"IF(K27<$E$13,0,IF(K27>$E$16,$E$16-$E$13-SUM($L$25:L26),K27-$E$13-SUM($L$25:L26)))","v":{"$error":"#N/A"}},{"$f":"IF($E$16<$N$4,($E$10*(J27/366)*L27)/1000,0)","v":{"v":0,"d":"$0.00"}},null,"Ene",{"$f":"INDEX('Tasas de Interes'!$D$3:$BB$14,MATCH($O27,'Tasas de Interes'!$B$3:$B$14,0),MATCH($N$26,'Tasas de Interes'!$D$2:$BB$2,0))","v":{"$error":"#N/A"}},{"$f":"EOMONTH(DATE($N$26,VLOOKUP(O28,'Tasas de Interes'!$B$3:$C$14,2,0),0),0)","v":{"$error":"#N/A"}},{"$f":"IF(Q27<$E$13,0,IF(Q27>$E$16,$E$16-$E$13-SUM($R$25:R26),Q27-$E$13-SUM($R$25:R26)))","v":{"$error":"#N/A"}},{"$f":"IF($E$16<$N$4,($E$10*(P27/366)*R27)/1000,0)","v":{"v":0,"d":"$0.00"}}]
[null,null,"Feb",{"$f":"INDEX('Tasas de Interes'!$D$3:$BB$14,MATCH($C28,'Tasas de Interes'!$B$3:$B$14,0),MATCH($B$26,'Tasas de Interes'!$D$2:$BB$2,0))","v":{"v":0.243,"d":"24.30%"}},{"$f":"EOMONTH(DATE($B$26,VLOOKUP(C29,'Tasas de Interes'!$B$3:$C$14,2,0),0),0)","v":"2025-02-28"},{"$f":"IF(E28<$E$13,0,IF(E28>$E$16,$E$16-$E$13-SUM($F$25:F27),E28-$E$13-SUM($F$25:F27)))","v":0},{"$f":"IF($E$16<$N$4,($E$10*(D28/366)*F28)/1000,0)","v":{"v":0,"d":"$0.00"}},null,"Feb",{"$f":"INDEX('Tasas de Interes'!$D$3:$BB$14,MATCH($I28,'Tasas de Interes'!$B$3:$B$14,0),MATCH($H$26,'Tasas de Interes'!$D$2:$BB$2,0))","v":{"$error":"#N/A"}},{"$f":"EOMONTH(DATE($H$26,VLOOKUP(I29,'Tasas de Interes'!$B$3:$C$14,2,0),0),0)","v":{"$error":"#N/A"}},{"$f":"IF(K28<$E$13,0,IF(K28>$E$16,$E$16-$E$13-SUM($L$25:L27),K28-$E$13-SUM($L$25:L27)))","v":{"$error":"#N/A"}},{"$f":"IF($E$16<$N$4,($E$10*(J28/366)*L28)/1000,0)","v":{"v":0,"d":"$0.00"}},null,"Feb",{"$f":"INDEX('Tasas de Interes'!$D$3:$BB$14,MATCH($O28,'Tasas de Interes'!$B$3:$B$14,0),MATCH($N$26,'Tasas de Interes'!$D$2:$BB$2,0))","v":{"$error":"#N/A"}},{"$f":"EOMONTH(DATE($N$26,VLOOKUP(O29,'Tasas de Interes'!$B$3:$C$14,2,0),0),0)","v":{"$error":"#N/A"}},{"$f":"IF(Q28<$E$13,0,IF(Q28>$E$16,$E$16-$E$13-SUM($R$25:R27),Q28-$E$13-SUM($R$25:R27)))","v":{"$error":"#N/A"}},{"$f":"IF($E$16<$N$4,($E$10*(P28/366)*R28)/1000,0)","v":{"v":0,"d":"$0.00"}}]
[null,null,"Mar",{"$f":"INDEX('Tasas de Interes'!$D$3:$BB$14,MATCH($C29,'Tasas de Interes'!$B$3:$B$14,0),MATCH($B$26,'Tasas de Interes'!$D$2:$BB$2,0))","v":{"v":0.2292,"d":"22.92%"}},{"$f":"EOMONTH(DATE($B$26,VLOOKUP(C30,'Tasas de Interes'!$B$3:$C$14,2,0),0),0)","v":"2025-03-31"},{"$f":"IF(E29<$E$13,0,IF(E29>$E$16,$E$16-$E$13-SUM($F$25:F28),E29-$E$13-SUM($F$25:F28)))","v":0},{"v":0,"d":"$0.00"},null,"Mar",{"$f":"INDEX('Tasas de Interes'!$D$3:$BB$14,MATCH($I29,'Tasas de Interes'!$B$3:$B$14,0),MATCH($H$26,'Tasas de Interes'!$D$2:$BB$2,0))","v":{"$error":"#N/A"}},{"$f":"EOMONTH(DATE($H$26,VLOOKUP(I30,'Tasas de Interes'!$B$3:$C$14,2,0),0),0)","v":{"$error":"#N/A"}},{"$f":"IF(K29<$E$13,0,IF(K29>$E$16,$E$16-$E$13-SUM($L$25:L28),K29-$E$13-SUM($L$25:L28)))","v":{"$error":"#N/A"}},{"v":0,"d":"$0.00"},null,"Mar",{"$f":"INDEX('Tasas de Interes'!$D$3:$BB$14,MATCH($O29,'Tasas de Interes'!$B$3:$B$14,0),MATCH($N$26,'Tasas de Interes'!$D$2:$BB$2,0))","v":{"$error":"#N/A"}},{"$f":"EOMONTH(DATE($N$26,VLOOKUP(O30,'Tasas de Interes'!$B$3:$C$14,2,0),0),0)","v":{"$error":"#N/A"}},{"$f":"IF(Q29<$E$13,0,IF(Q29>$E$16,$E$16-$E$13-SUM($R$25:R28),Q29-$E$13-SUM($R$25:R28)))","v":{"$error":"#N/A"}},{"v":0,"d":"$0.00"}]
[null,null,"Abr",{"$f":"INDEX('Tasas de Interes'!$D$3:$BB$14,MATCH($C30,'Tasas de Interes'!$B$3:$B$14,0),MATCH($B$26,'Tasas de Interes'!$D$2:$BB$2,0))","v":{"v":0.2362,"d":"23.62%"}},{"$f":"EOMONTH(DATE($B$26,VLOOKUP(C31,'Tasas de Interes'!$B$3:$C$14,2,0),0),0)","v":"2025-04-30"},{"$f":"IF(E30<$E$13,0,IF(E30>$E$16,$E$16-$E$13-SUM($F$25:F29),E30-$E$13-SUM($F$25:F29)))","v":0},{"v":0,"d":"$0.00"},null,"Abr",{"$f":"INDEX('Tasas de Interes'!$D$3:$BB$14,MATCH($I30,'Tasas de Interes'!$B$3:$B$14,0),MATCH($H$26,'Tasas de Interes'!$D$2:$BB$2,0))","v":{"$error":"#N/A"}},{"$f":"EOMONTH(DATE($H$26,VLOOKUP(I31,'Tasas de Interes'!$B$3:$C$14,2,0),0),0)","v":{"$error":"#N/A"}},{"$f":"IF(K30<$E$13,0,IF(K30>$E$16,$E$16-$E$13-SUM($L$25:L29),K30-$E$13-SUM($L$25:L29)))","v":{"$error":"#N/A"}},{"v":0,"d":"$0.00"},null,"Abr",{"$f":"INDEX('Tasas de Interes'!$D$3:$BB$14,MATCH($O30,'Tasas de Interes'!$B$3:$B$14,0),MATCH($N$26,'Tasas de Interes'!$D$2:$BB$2,0))","v":{"$error":"#N/A"}},{"$f":"EOMONTH(DATE($N$26,VLOOKUP(O31,'Tasas de Interes'!$B$3:$C$14,2,0),0),0)","v":{"$error":"#N/A"}},{"$f":"IF(Q30<$E$13,0,IF(Q30>$E$16,$E$16-$E$13-SUM($R$25:R29),Q30-$E$13-SUM($R$25:R29)))","v":{"$error":"#N/A"}},{"v":0,"d":"$0.00"}]
{"$rows_left_out":74}
{"sheet":"Tasas de Interes","index":1,"n_rows":49,"n_cols":54,"rows_kept":49,"merged":[[49,1,49,2]]}
[]
["NM","MES","Nro Mes",2006,2007,2008,2009,2010,2011,2012,2013,2014,2015,2016,2017,2018,2019,2020,2021,2022,2023,2024,2025,2026,2027,2028,2029,2030,2031,2032,2033,2034,2035,2036,2037,2038,2039,2040,2041,2042,2043,2044,2045,2046,2047,2048,2049,2050,2051,2052,2053,2054,2055,2056]
[1,"Ene",1,{"v":0.2063,"d":"20.630%"},{"v":0.20745000000000002,"d":"20.745%"},{"v":0.3275,"d":"32.750%"},{"v":0.3071,"d":"30.710%"},{"v":0.2421,"d":"24.210%"},{"v":0.2342,"d":"23.420%"},{"v":0.2988,"d":"29.880%"},{"v":0.3113,"d":"31.130%"},{"v":0.2948,"d":"29.480%"},{"v":0.2882,"d":"28.820%"},{"v":0.2952,"d":"29.520%"},{"v":0.3151,"d":"31.510%"},{"v":0.2904,"d":"29.040%"},{"v":0.26739999999999997,"d":"26.740%"},{"v":0.2616,"d":"26.160%"},{"v":0.2398,"d":"23.980%"},{"v":0.2449,"d":"24.490%"},{"v":0.4126,"d":"41.260%"},{"v":0.3298,"d":"32.980%"},{"v":0.2289,"d":"22.890%"},{"v":0.2236,"d":"22.360%"}]
[2,"Feb",2,{"v":0.2063,"d":"20.630%"},{"v":0.20745000000000002,"d":"20.745%"},{"v":0.3275,"d":"32.750%"},{"v":0.3071,"d":"30.710%"},{"v":0.2421,"d":"24.210%"},{"v":0.2342,"d":"23.420%"},{"v":0.2988,"d":"29.880%"},{"v":0.3113,"d":"31.130%"},{"v":0.2948,"d":"29.480%"},{"v":0.2882,"d":"28.820%"},{"v":0.2952,"d":"29.520%"},{"v":0.3151,"d":"31.510%"},{"v":0.29519999999999996,"d":"29.520%"},{"v":0.27549999999999997,"d":"27.550%"},{"v":0.26589999999999997,"d":"26.590%"},{"v":0.2431,"d":"24.310%"},{"v":0.2545,"d":"25.450%"},{"v":0.4327,"d":"43.270%"},{"v":0.3297,"d":"32.970%"},{"v":0.243,"d":"24.300%"},{"v":0.2323,"d":"23.230%"}]
[3,"Mar",3,{"v":0.2063,"d":"20.630%"},{"v":0.20745000000000002,"d":"20.745%"},{"v":0.3275,"d":"32.750%"},{"v":0.3071,"d":"30.710%"},{"v":0.2421,"d":"24.210%"},{"v":0.2342,"d":"23.420%"},{"v":0.2988,"d":"29.880%"},{"v":0.3113,"d":"31.130%"},{"v":0.2948,"d":"29.480%"},{"v":0.2882,"d":"28.820%"},{"v":0.2952,"d":"29.520%"},{"v":0.3151,"d":"31.510%"},{"v":0.29019999999999996,"d":"29.020%"},{"v":0.27059999999999995,"d":"27.060%"},{"v":0.2643,"d":"26.430%"},{"v":0.2412,"d":"24.120%"},{"v":0.2571,"d":"25.710%"},{"v":0.4426,"d":"44.260%"},{"v":0.313,"d":"31.300%"},{"v":0.2292,"d":"22.920%"}]
[4,"Abr",4,{"v":0.2063,"d":"20.630%"},{"v":0.25120000000000003,"d":"25.120%"},{"v":0.3288,"d":"32.880%"},{"v":0.3042,"d":"30.420%"},{"v":0.2297,"d":"22.970%"},{"v":0.2654,"d":"26.540%"},{"v":0.3078,"d":"30.780%"},{"v":0.3125,"d":"31.250%"},{"v":0.2945,"d":"29.450%"},{"v":0.2906,"d":"29.060%"},{"v":0.3081,"d":"30.810%"},{"v":0.315,"d":"31.500%"},{"v":0.28719999999999996,"d":"28.720%"},{"v":0.2698,"d":"26.980%"},{"v":0.26039999999999996,"d":"26.040%"},{"v":0.2397,"d":"23.970%"},{"v":0.2658,"d":"26.580%"},{"v":0.4509,"d":"45.090%"},{"v":0.3109,"d":"31.090%"},{"v":0.2362,"d":"23.620%"}]
[5,"May",5,{"v":0.2063,"d":"20.630%"},{"v":0.25120000000000003,"d":"25.120%"},{"v":0.3288,"d":"32.880%"},{"v":0.3042,"d":"30.420%"},{"v":0.2297,"d":"22.970%"},{"v":0.2654,"d":"26.540%"},{"v":0.3078,"d":"30.780%"},{"v":0.3125,"d":"31.250%"},{"v":0.2945,"d":"29.450%"},{"v":0.2906,"d":"29.060%"},{"v":0.3081,"d":"30.810%"},{"v":0.315,"d":"31.500%"},{"v":0.28659999999999997,"d":"28.660%"},{"v":0.2701,"d":"27.010%"},{"v":0.25289999999999996,"d":"25.290%"},{"v":0.2383,"d":"23.830%"},{"v":0.2757,"d":"27.570%"},{"v":0.4341,"d":"43.410%"},{"v":0.2953,"d":"29.530%"},{"v":0.2397,"d":"23.970%"}]
[6,"Jun",6,{"v":0.2063,"d":"20.630%"},{"v":0.25120000000000003,"d":"25.120%"},{"v":0.3288,"d":"32.880%"},{"v":0.3042,"d":"30.420%"},{"v":0.2297,"d":"22.970%"},{"v":0.2654,"d":"26.540%"},{"v":0.3078,"d":"30.780%"},{"v":0.3125,"d":"31.250%"},{"v":0.2945,"d":"29.450%"},{"v":0.2906,"d":"29.060%"},{"v":0.3081,"d":"30.810%"},{"v":0.315,"d":"31.500%"},{"v":0.2842,"d":"28.420%"},{"v":0.26949999999999996,"d":"26.950%"},{"v":0.1812,"d":"18.120%"},{"v":0.2382,"d":"23.820%"},{"v":0.286,"d":"28.600%"},{"v":0.4264,"d":"42.640%"},{"v":0.2884,"d":"28.840%"},{"v":0.2355,"d":"23.550%"}]
[7,"Jul",7,{"v":0.2262,"d":"22.620%"},{"v":0.2851,"d":"28.510%"},{"v":0.3227,"d":"32.270%"},{"v":0.2798,"d":"27.980%"},{"v":0.2241,"d":"22.410%"},{"v":0.2795,"d":"27.950%"},{"v":0.3129,"d":"31.290%"},{"v":0.3051,"d":"30.510%"},{"v":0.29,"d":"29.000%"},{"v":0.2889,"d":"28.890%"},{"v":0.3201,"d":"32.010%"},{"v":0.3097,"d":"30.970%"},{"v":0.28049999999999997,"d":"28.050%"},{"v":0.2692,"d":"26.920%"},{"v":0.1812,"d":"18.120%"},{"v":0.2377,"d":"23.770%"},{"v":0.2992,"d":"29.920%"},{"v":0.4204,"d":"42.040%"},{"v":0.2749,"d":"27.490%"},{"v":0.2278,"d":"22.780%"}]
[8,"Ago",8,{"v":0.2253,"d":"22.530%"},{"v":0.2851,"d":"28.510%"},{"v":0.3227,"d":"32.270%"},{"v":0.2798,"d":"27.980%"},{"v":0.2241,"d":"22.410%"},{"v":0.2795,"d":"27.950%"},{"v":0.3129,"d":"31.290%"},{"v":0.3051,"d":"30.510%"},{"v":0.29,"d":"29.000%"},{"v":0.2889,"d":"28.890%"},{"v":0.3201,"d":"32.010%"},{"v":0.3097,"d":"30.970%"},{"v":0.27909999999999996,"d":"27.910%"},{"v":0.2698,"d":"26.980%"},{"v":0.1829,"d":"18.290%"},{"v":0.2386,"d":"23.860%"},{"v":0.3132,"d":"31.320%"},{"v":0.4113,"d":"41.130%"},{"v":0.2721,"d":"27.210%"},{"v":0.2317,"d":"23.170%"}]
[9,"Sep",9,{"v":0.22575,"d":"22.575%"},{"v":0.2851,"d":"28.510%"},{"v":0.3227,"d":"32.270%"},{"v":0.2798,"d":"27.980%"},{"v":0.2241,"d":"22.410%"},{"v":0.2795,"d":"27.950%"},{"v":0.3129,"d":"31.290%"},{"v":0.3051,"d":"30.510%"},{"v":0.29,"d":"29.000%"},{"v":0.2889,"d":"28.890%"},{"v":0.3201,"d":"32.010%"},{"v":0.3022,"d":"30.220%"},{"v":0.27719999999999995,"d":"27.720%"},{"v":0.2698,"d":"26.980%"},{"v":0.1835,"d":"18.350%"},{"v":0.2379,"d":"23.790%"},{"v":0.3325,"d":"33.250%"},{"v":0.4005,"d":"40.050%"},{"v":0.2685,"d":"26.850%"},{"v":0.2301,"d":"23.010%"}]
[10,"Oct",10,{"v":0.22605,"d":"22.605%"},{"v":0.3189,"d":"31.890%"},{"v":0.3153,"d":"31.530%"},{"v":0.2592,"d":"25.920%"},{"v":0.2132,"d":"21.320%"},{"v":0.2909,"d":"29.090%"},{"v":0.3134,"d":"31.340%"},{"v":0.2978,"d":"29.780%"},{"v":0.2876,"d":"28.760%"},{"v":0.29,"d":"29.000%"},{"v":0.3299,"d":"32.990%"},{"v":0.2973,"d":"29.730%"},{"v":0.27449999999999997,"d":"27.450%"},{"v":0.26649999999999996,"d":"26.650%"},{"v":0.1809,"d":"18.090%"},{"v":0.2362,"d":"23.620%"},{"v":0.3492,"d":"34.920%"},{"v":0.378,"d":"37.800%"},{"v":0.2617,"d":"26.170%"},{"v":0.2236,"d":"22.360%"}]
[11,"Nov",11,{"v":0.22605,"d":"22.605%"},{"v":0.3189,"d":"31.890%"},{"v":0.3153,"d":"31.530%"},{"v":0.2592,"d":"25.920%"},{"v":0.2132,"d":"21.320%"},{"v":0.2909,"d":"29.090%"},{"v":0.3134,"d":"31.340%"},{"v":0.2978,"d":"29.780%"},{"v":0.2876,"d":"28.760%"},{"v":0.29,"d":"29.000%"},{"v":0.3299,"d":"32.990%"},{"v":0.2944,"d":"29.440%"},{"v":0.2724,"d":"27.240%"},{"v":0.2655,"d":"26.550%"},{"v":0.1784,"d":"17.840%"},{"v":0.2391,"d":"23.910%"},{"v":0.3667,"d":"36.670%"},{"v":0.3628,"d":"36.280%"},{"v":0.259,"d":"25.900%"},{"v":0.2299,"d":"22.990%"}]
[12,"Dic",12,{"v":0.22605,"d":"22.605%"},{"v":0.3189,"d":"31.890%"},{"v":0.3153,"d":"31.530%"},{"v":0.2592,"d":"25.920%"},{"v":0.2132,"d":"21.320%"},{"v":0.2909,"d":"29.090%"},{"v":0.3134,"d":"31.340%"},{"v":0.2978,"d":"29.780%"},{"v":0.2876,"d":"28.760%"},{"v":0.29,"d":"29.000%"},{"v":0.3299,"d":"32.990%"},{"v":0.2916,"d":"29.160%"},{"v":0.271,"d":"27.100%"},{"v":0.2637,"d":"26.370%"},{"v":0.2419,"d":"24.190%"},{"v":0.2419,"d":"24.190%"},{"v":0.3946,"d":"39.460%"},{"v":0.3556,"d":"35.560%"},{"v":0.2439,"d":"24.390%"},{"v":0.2302,"d":"23.020%"}]
[]
[{"$nulls":3},"Esta tabla se debe estar actualizando en la medida que se publiquen las Tasas de Impuesto de Renta y Complementarios:"]
[{"$nulls":3},"Descargar"]
[]
[{"$nulls":3},"Esta es la circular de la Dian con base a la cual se realiza la liquidación de los intereses"]
[{"$nulls":3},"Descargar",{"$nulls":44},{"$f":"IF(AW14<>\"\",1,0)","v":0},0,0,0,0,0]
[{"$nulls":48},{"$f":"IF(AND(AW20=0,AV20=1),1,0)","v":0},{"$f":"IF(AND(AX20=0,AW20=1),1,0)","v":0},{"$f":"IF(AND(AY20=0,AX20=1),1,0)","v":0},{"$f":"IF(AND(AZ20=0,AY20=1),1,0)","v":0},{"$f":"IF(AND(BA20=0,AZ20=1),1,0)","v":0},{"$f":"IF(AND(BB20=0,BA20=1),1,0)","v":0}]
[]
[{"$nulls":48},1,1,1,1,1,1]
[{"$nulls":48},{"$f":"IF(AW$21=1,IF(AW3<>\"\",1,0),1)","v":1},1,1,1,1,1]
[{"$nulls":48},{"$f":"IF(AW$21=1,IF(AW4<>\"\",1,0),1)","v":1},1,1,1,1,1]
[{"$nulls":48},{"$f":"IF(AW$21=1,IF(AW5<>\"\",1,0),1)","v":1},1,1,1,1,1]
[{"$nulls":48},{"$f":"IF(AW$21=1,IF(AW6<>\"\",1,0),1)","v":1},1,1,1,1,1]
[{"$nulls":48},{"$f":"IF(AW$21=1,IF(AW7<>\"\",1,0),1)","v":1},1,1,1,1,1]
[{"$nulls":48},{"$f":"IF(AW$21=1,IF(AW8<>\"\",1,0),1)","v":1},1,1,1,1,1]
[{"$nulls":48},{"$f":"IF(AW$21=1,IF(AW9<>\"\",1,0),1)","v":1},1,1,1,1,1]
{"$rows_left_out":19}